{"text_format":"1","workbook":"xlsx","n_sheets":4,"sheets":["Read me","Import Certificate","Request form","VBAHelper"],"not_rendered":{"charts":0,"images":1,"macros":0,"external_links":0,"defined_names":5,"comments":0,"pivot_tables":0},"unopened":[],"bounds":{"document_bytes":16777216,"sheet_cells":100000,"rows_first":2000,"rows_last":500,"rows_between":2000,"halvings":0,"cell_chars":16384,"cell_head_chars":4096},"cells_cut":0,"cells_raw":0,"read":"whole","date_system":"1900"}

{"sheet":"Read me","index":0,"n_rows":31,"n_cols":13,"rows_kept":31,"cut":false,"hidden":false,"merged":[[0,0,0,2]]}
["Instructions on how to fill in this request form",null,null,null,null,null,null,null,null,"year","month","days","<= ne pas supprimer"]
[null,null,null,null,null,null,null,null,null,2024,1,1]
[null,"These instructions are designed to help you complete the National Organic Program (NOP) Import Certificate request form (2nd tab):",null,null,null,null,null,null,null,2025,2,2]
[null,"mandatory fields to be completed",null,null,null,null,null,null,null,2026,3,3]
[null,"Please complete 1 Request form per importer",null,null,null,null,null,null,null,2027,4,4]
[1,"certification standard","Select from Organic Standards List - Dropdown Menu - for NOP certified products: select USDA-NOP (U.S.A.)",null,null,null,null,null,null,2028,5,5]
{"$rows_left_out":26}
{"sheet":"Import Certificate","index":1,"n_rows":24,"n_cols":95,"rows_kept":24,"cut":false,"hidden":true,"merged":[]}
["ic_certNum","ic_certStatus","ic_certifier","ic_isuCbWebSite","ic_isuCbHasAltContact","ic_isuCbContAddLine1","ic_isuCbContAddLine2","ic_isuCbContCity","ic_isuCbContState","ic_isuCbContCountry","ic_isuCbContZip","ic_isuCbContFName","ic_isuCbContLName","ic_isuCbContPhone","ic_isuCbContEmail","ic_program","ic_SingleShipment","ic_startDate","ic_endDate","ic_expCountry","ic_expNOPId","ic_altExpContact","ic_altExpFirstName","ic_altExpLastName","ic_altExpPhNum","ic_altExpEmail","ic_unCertExp","ic_unCertExpOpName","ic_unCertExpAddLine1","ic_unCertExpAddLine2","ic_unCertExpCity","ic_unCertExpState","ic_unCertExpCountry","ic_unCertExpZipPostal","ic_ucExpFirstName","ic_ucExpLastName","ic_ucExpPhNum","ic_ucExpEmail","ic_fhSameExp","ic_fhNopId","ic_fhAltContact","ic_fhAltFirstName","ic_fhAltLastName","ic_fhAltPhNum","ic_fhAltEmail","ic_fhOpName","ic_fhAddLine1","ic_fhAddLine2","ic_fhCity","ic_fhState","ic_fhCountry","ic_fhZip","ic_fhContactFName","ic_fhContactLName","ic_fhContactPhone","ic_fhContactEmail","ic_fhCertBody","ic_fhCBAddLine1","ic_fhCBAddLine2","ic_fhCBCity","ic_fhCBState","ic_fhCBCountry","ic_fhCBZip","ic_fhCBFName","ic_fhCBLName","ic_fhCBPhone","ic_fhCBEmail","ic_recNopId","ic_altRecContact","ic_altRecFirstName","ic_altRecLastName","ic_altRecPhNum","ic_altRecEmail","ic_unCertRec","ic_unCertRecOpName","ic_unCertRecAddLine1","ic_unCertRecAddLine2","ic_unCertRecCity","ic_unCertRecState","ic_unCertRecCountry","ic_unCertRecZipPostal","ic_ucRecFirstName","ic_ucRecLastName","ic_ucRecPhNum","ic_ucRecEmail","ic_product","ic_htsCode","ic_totalWeight","ic_totalContainers","ic_lotNum","ic_productCityState","ic_remarks","ic_attestations","ic_certIssuerFullName","ic_dateSigned"]
["Import Certificate Number (Box 4)","Import Certificate Status","Certifying Body (CB) Issuing Certificate (Box 8)","Issuing CB Website","Issuing CB Alternate Contact Information (Box 8)","Issuing CB Contact Address Line 1 (Box 8)","Issuing CB Contact Address Line 2 (Box 8)","Issuing CB Contact City (Box 8)","Issuing CB Contact State/ Province (Box 8)","Issuing CB Contact Country (Box 8)","Issuing CB Contact ZIP/Postal Code (Box 8)","Issuing CB Contact First Name (Box 8)","Issuing CB Contact Last Name (Box 8)","Issuing CB Contact Phone Number (Box 8)"," Issuing CB Contact Email (Box 8)","Organic Standard Product Certified To (Box 1)","Single Shipment","Certificate Start Date (Box 3)","Certificate End Date (Box 3)","Product Exported From (Box 6)","Certified Exporter NOP ID (Box 5)","Alternate Certified Exporter Contact Information","Alternate Certified Exporter Contact First Name (Box 5)","Alternate Certified Exporter Contact Last Name (Box 5)","Alternate Certified Exporter Contact Phone Number (Box 5)","Alternate Certified Exporter Contact Email (Box 5)","Uncertified Exporter","Exporter Operation Name (Box 5)","Exporter Address Line 1 (Box 5)","Exporter Address Line 2 (Box 5)","Exporter City (Box 5)","Exporter State/ Province (Box 5)","Exporter Country (Box 5)","Exporter ZIP/Postal Code (Box 5)","Exporter Contact First Name (Box 5)","Exporter Contact Last Name (Box 5)","Exporter Contact Phone Number (Box 5)","Exporter Contact Email (Box 5)","Final Handler is the same as Exporter","Certified Final Handler NOP ID (Box 14)","Alternate Final Handler Contact Information","Alternate Final Handler Contact First Name (Box 14)","Alternate Final Handler Contact Last Name (Box 14)","Alternate Final Handler Contact Phone Number (Box 14)","Alternate Final Handler Contact Email (Box 14)","Final Handler Operation Name (Box 14)","Final Handler Address Line 1 (Box 14)","Final Handler Address Line 2 (Box 14)","Final Handler City (Box 14)","Final Handler State/ Province (Box 14)","Final Handler Country (Box14)","Final Handler ZIP/Postal Code (Box 14)","Final Handler Contact First Name (Box 14)","Final Handler Contact Last Name (Box 14)","Final Handler Contact Phone Number (Box 14)","Final Handler Contact Email (Box 14)","Certifying Body (CB) of Final Handler (Box 15)","Final Handler CB Address Line 1 (Box 15)","Final Handler CB Address Line 2 (Box 15)","Final Handler CB City (Box 15)","Final Handler CB State/Province (Box 15)","Final Handler CB Country (Box 15)","Final Handler CB ZIP/Postal Code (Box 15)","Final Handler CB Contact First Name (Box 15)","Final Handler CB Contact Last Name (Box 15)","Final Handler CB Contact Phone Number (Box 15)","Final Handler CB Contact Email (Box 15)","NOP ID for Certified Recipient in the U.S. (Box 7)","Alternate Certified Recipient Contact Information","Alternate Certified Recipient Contact First Name (Box 7)","Alternate Certified Recipient Contact Last Name (Box 7)","Alternate Certified Recipient Contact Phone Number (Box 7)","Alternate Certified Recipient Contact Email (Box 7)","Uncertified Recipient (Box 7)","Recipient Operation Name (Box 7)","Recipient Address Line 1 (Box 7)","Recipient Address Line 2 (Box 7)","Recipient City (Box 7)","Recipient State (box 7)","Recipient Country (Box 7)","Recipient ZIP/Postal Code (Box 7)","Recipient Contact First Name (Box 7)","Recipient Contact Last Name (Box 7)","Recipient Phone Number (Box 7)","Recipient Email (Box 7)","Product As Labeled (Box 11)","HTS Code (Box 12)","Total Net Weight (Box 9)","Total Containers (Box 10) ","Shipping Identification - Flight #, Vessel #, Container #, Lot #, etc.  (Box 13) ","City and State of Product Destination (Box 2)","Remarks (Box 16)","Attestations (Box 16)","Certificate Issuer Full Name (Box 17)","Date Signed  (Box 18)"]
["Optional","Autofilled - Do Not Edit","Autofilled from User Profile - Do Not Edit","Autofilled from User Profile - Do Not Edit","Yes as applicable","Autofilled or Required for Issuing Certifier Satellite Office/ Alternate Contact","Autofilled or Optional for Issuing Certifier Satellite Office/ Alternate Contact","Autofilled or Required for Issuing Certifier Satellite Office/ Alternate Contact (US)","Autofilled or Required for Issuing Certifier Satellite Office/ Alternate Contact (US)","Autofilled or Required for Issuing Certifier Satellite Office/ Alternate Contact","Autofilled or Required for Issuing Certifier Satellite Office/ Alternate Contact (US)","Autofilled or Required for Issuing Certifier Satellite Office/ Alternate Contact","Autofilled or Required for Issuing Certifier Satellite Office/ Alternate Contact","Autofilled or Required for Issuing Certifier Satellite Office/ Alternate Contact","Autofilled or Required for Issuing Certifier Satellite Office/ Alternate Contact","Required","Yes as applicable","Required","Required - Published ICs can be edited to up to 18 months from Start Date.","Required","Required for Certified Exporters. If Certified, do not complete columns AA-AL.","Yes as applicable","Optional. If any data is entered into columns W-Z, all columns must be complete in order to generate certificate.","Optional. If any data is entered into columns W-Z, all columns must be complete in order to generate certificate.","Optional. If any data is entered into columns W-Z, all columns must be complete in order to generate certificate.","Optional. If any data is entered into columns W-Z, all columns must be complete in order to generate certificate.","Yes as applicable","Required if Uncertified, Autofilled if Certified","Required if Uncertified, Autofilled if Certified","Optional; Autofilled if Certified","Required if Uncertified (US). Autofilled if Certified.","Required if Uncertified (US). Autofilled if Certified.","Required if Uncertified, Autofilled if Certified","Required if Uncertified (US). Autofilled if Certified.","Required if Uncertified, Autofilled if Certified","Required if Uncertified, Autofilled if Certified","Required if Uncertified, Autofilled if Certified","Required if Uncertified, Autofilled if Certified","Yes as applicable","Required if Final Handler is not same as Certified Exporter (Column AM = No)","Yes as applicable","Optional. If any data entered into columns AP-AS, all columns must be complete in order to generate certificate.","Optional. If any data entered into columns AP-AS, all columns must be complete in order to generate certificate.","Optional. If any data entered into columns AP-AS, all columns must be complete in order to generate certificate.","Optional. If any data entered into columns AP-AS, all columns must be complete in order to generate certificate.","Autofilled","Autofilled","Autofilled","Autofilled","Autofilled","Autofilled","Autofilled","Autofilled","Autofilled","Autofilled","Autofilled","Autofilled from Final Handler Operation Profile","Autofilled","Autofilled","Autofilled","Autofilled","Autofilled","Autofilled","Autofilled","Autofilled","Autofilled","Autofilled","Required for Certified Recipients. If Certified, do not complete columns BV-CG.","Yes as applicable","Optional. If any data entered into columns BR-BU, all columns must be complete in order to generate certificate.","Optional. If any data entered into columns BR-BU, all columns must be complete in order to generate certificate.","Optional. If any data entered into columns BR-BU, all columns must be complete in order to generate certificate.","Optional. If any data entered into columns BR-BU, all columns must be complete in order to generate certificate.","Yes as applicable","Required if Uncertified, Autofilled if Certified","Required if Uncertified, Autofilled if Certified","Optional, Autofilled if Certified","Required if Uncertified (US). Autofilled if Certified","Required if Uncertified (US). Autofilled if Certified","Required if Uncertified, Autofilled if Certified","Required if Uncertified (US). Autofilled if Certified","Required if Uncertified, Autofilled if Certified","Required if Uncertified, Autofilled if Certified","Required if Uncertified, Autofilled if Certified","Required if Uncertified, Autofilled if Certified","Required","Required","Required - Published ICs can be edited.","Optional - Published ICs can be edited.","Optional - Published ICs can be edited.","Autofilled from Recipient in U.S. - Do Not Edit","Optional - Published ICs can be edited.","Required","Autofilled from User Profile - Do Not Edit.","Autofilled from Publication Date - Do Not Edit."]
["Leave blank for new certificates, enter existing certificate number to edit. Columns S, CJ, CK, CL, CN can be edited.","Valid/Invalid. Available in exports from Published ICs/IC Search. Do not edit - database does not process this column.","Certifier Name (ISO 3 Letter Country Code for Program). Available in exports from Published ICs/IC Search. Do not edit - database does not process this column.","From Certifier Profile.  Available in exports from Published ICs/IC Search. Do not edit - database does not process this column.","Yes/No. Leave columns F-O blank if no Issuing Certifier Satellite Office/Alternate Contact Information is needed.","From Certifier Profile or Satellite Office Alternate Information","From Certifier Profile or Satellite Office Alternate Information","From Certifier Profile or Satellite Office Alternate Information","From Certifier Profile or Satellite Office Alternate Information","From Certifier Profile or Satellite Office Alternate Information.","From Certifier Profile or Satellite Office Alternate Information","From Certifier Profile or Satellite Office/User Alternate Information","From Certifier Profile or Satellite Office/User Alternate Information","From Certifier Profile or Satellite Office/User Alternate Information","From Certifier Profile or Satellite Office/User Alternate Information","Select from Organic Standards List","Yes/No","Date the selected Import Certificate became effective. MM/DD/YYYY","Date the selected Import Certificate  effective date ended. For single shipment, enter same date as Start Date. MM/DD/YYYY","Select from Country List","NOP's 10-digit unique ID for operation. If entered, columns AA-AL  will be ignored.","Yes/No. Leave columns W-Z blank if no Alternate Exporter Contact Information is needed.",null,null,null,null,"Yes/No. Leave columns AB-AL blank if Certified Exporter NOP Operation ID is entered in Column U. ","Operation's business name. Do not edit if Certified- database does not process this column for Certified Exporters.","Do not edit if Certified - database does not process this column for Certified Exporters.","Do not edit if Certified - database does not process this column for Certified Exporters.","Do not edit if Certified - database does not process this column for Certified Exporters.","Do not edit if Certified - database does not process this column for Certified Exporters.","Select from Country List.  Do not edit if Certified - database does not process this column for Certified Exporters.","Do not edit if Certified - database does not process this column for Certified Exporters.","Do not edit if Certified - database does not process this column for Certified Exporters.","Do not edit if Certified - database does not process this column for Certified Exporters.","Do not edit if Certified - database does not process this column for Certified Exporters.","Do not edit if Certified - database does not process this column for Certified Exporters.","Yes/No. If Yes, do not complete columns AN-BD, and column U must be completed with NOP 10-digit unique ID for Certified Exporter","NOP's 10-digit unique ID for operation. Final Handler must be certified.","Yes/No. Leave columns AP-AS blank if no Alternate Certified Final Handler Contact Information is needed.",null,null,null,null,"Operation's business name. Available in exports from Published ICs/IC Search. Do not edit  - database does not process this column.","Available in exports from Published ICs/IC Search. Do not edit - database does not process this column.","Available in exports from Published ICs/IC Search. Do not edit - database does not process this column.","Available in exports from Published ICs/IC Search. Do not edit - database does not process this column.","Available in exports from Published ICs/IC Search. Do not edit - database does not process this column.","Available in exports from Published ICs/IC Search. Do not edit - database does not process this column.","Available in exports from Published ICs/IC Search. Do not edit - database does not process this column.","Available in exports from Published ICs/IC Search. Do not edit - database does not process this column.","Available in exports from Published ICs/IC Search. Do not edit - database does not process this column.","Available in exports from Published ICs/IC Search. Do not edit - database does not process this column.","Available in exports from Published ICs/IC Search. Do not edit - database does not process this column.","Certifier Name (ISO 3 Letter Country Code for Program). Available in exports from Published ICs/IC Search. Do not edit - database does not process this column.","From Certifier Profile. Available in exports from Published ICs/IC Search. Do not edit - database does not process this column.","From Certifier Profile. Available in exports from Published ICs/IC Search. Do not edit - database does not process this column.","From Certifier Profile. Available in exports from Published ICs/IC Search. Do not edit - database does not process this column.","From Certifier Profile. Available in exports from Published ICs/IC Search. Do not edit - database does not process this column.","From Certifier Profile. Available in exports from Published ICs/IC Search. Do not edit - database does not process this column.","From Certifier Profile. Available in exports from Published ICs/IC Search. Do not edit - database does not process this column.","From Certifier Profile. Available in exports from Published ICs/IC Search. Do not edit - database does not process this column.","From Certifier Profile. Available in exports from Published ICs/IC Search. Do not edit - database does not process this column.","From Certifier Profile. Available in exports from Published ICs/IC Search. Do not edit - database does not process this column.","From Certifier Profile. Available in exports from Published ICs/IC Search. Do not edit - database does not process this column.","NOP's 10-digit unique ID for operation. ","Yes/No. Leave columns BR-BU blank if no Alternate Certified Recipient Contact Information is needed. ",null,null,null,null,"Yes/No. Leave columns BW-CG blank if Certified Recipient NOP Operation ID is entered in Column BP.","Operation's business name. Do not edit if Certified - database does not process this column for Certified Recipients.","Do not edit if Certified - database does not process this column for Certified Recipients.","Do not edit if Certified - database does not process this column for Certified Recipients.","Do not edit if Certified - database does not process this column for Certified Recipients.","Do not edit if Certified - database does not process this column for Certified Recipients.","Select from Country List.  Do not edit if Certified - database does not process this column for Certified Recipients.","Do not edit if Certified - database does not process this column for Certified Recipients.","Do not edit if Certified - database does not process this column for Certified Recipients.","Do not edit if Certified - database does not process this column for Certified Recipients.","Do not edit if Certified - database does not process this column for Certified Recipients.","Do not edit if Certified - database does not process this column for Certified Recipients.","For raw products, enter the common name of the products(s). For packaged products, enter the name shown on the principal display panel (front of the package).","10-digit HTS Code from https://hts.usitc.gov (do not include punctuation)","Kilograms (KG) for all shipments.","Integer whole number","Max 4,000 Characters","Recipient City and State. Available in exports from Published ICs/IC Search. Do not edit - database does not process this column.","Max 256 Characters.","Select from Attestation List","Available in exports from Published ICs/IC Search. Do not edit - database does not process this column.","Available in exports from Published ICs/IC Search. Do not edit - database does not process this column."]
[null,null,null,null,null,null,null,null,null,null,null,null,null,null,null,{"$f":"IF(CH5<>\"\",'Request form'!$D$4,\"\")","v":""},{"$f":"IF(CH5<>\"\",'Request form'!$D$9,\"\")","v":""},{"$f":"IF(CH5<>\"\",IFERROR(IF(COUNTBLANK('Request form'!$D$7:$F$7)=0,'Request form'!$D$7&\"/\"&'Request form'!$E$7&\"/\"&'Request form'!$F$7,\"\"),\"\"),\"\")","v":""},{"$f":"IF(CH5<>\"\",IFERROR(IF(COUNTBLANK('Request form'!$D$8:$F$8)=0,'Request form'!$D$8&\"/\"&'Request form'!$E$8&\"/\"&'Request form'!$F$8,\"\"),\"\"),\"\")","v":""},{"$f":"IF(CH5<>\"\",'Request form'!$D$5,\"\")","v":""},{"$f":"IF(CH5<>\"\",'Request form'!$D$11,\"\")","v":""},{"$f":"IF($CH5<>\"\",\"No\",\"\")","v":""},null,null,null,null,{"$f":"IF($CH5<>\"\",\"No\",\"\")","v":""},null,null,null,null,null,null,null,null,null,null,null,{"$f":"IF(CH5<>\"\",IF('Request form'!D25=\"\",\"yes\",\"no\"),\"\")","v":""},{"$f":"IF(CH5<>\"\",IF(AM5=\"No\",'Request form'!D25,\"\"),\"\")","v":""},{"$f":"IF($CH5<>\"\",\"No\",\"\")","v":""},null,null,null,null,null,null,null,null,null,null,null,null,null,null,null,null,null,null,null,null,null,null,null,null,null,null,{"$f":"IF(CH5<>\"\",'Request form'!$D$14,\"\")","v":""},{"$f":"IF($CH5<>\"\",\"No\",\"\")","v":""},null,null,null,null,{"$f":"IF($CH5<>\"\",\"No\",\"\")","v":""},null,null,null,null,null,null,null,null,null,null,null,{"$f":"IF('Request form'!D18<>\"\",'Request form'!D18,\"\")","v":""},{"$f":"IF(CH5<>\"\",'Request form'!D19,\"\")","v":""},{"$f":"IF(CH5<>\"\",'Request form'!D20,\"\")","v":""},{"$f":"IF(AND(CH5<>\"\",'Request form'!D22<>\"\"),'Request form'!D22,\"\")","v":""},{"$f":"IF(AND(CH5<>\"\",'Request form'!D23<>\"\"),'Request form'!D23,\"\")","v":""},{"$f":"IF(CI5<>\"\",'Request form'!E23,\"\")","v":""},{"$f":"IF(AND(CH5<>\"\",'Request form'!D27<>\"\"),'Request form'!D27,\"\")","v":""},{"$f":"IFERROR(VLOOKUP($P5,VBAHelper!$D:$F,3,FALSE),\"\")","v":""}]
[null,null,null,null,null,null,null,null,null,null,null,null,null,null,null,{"$f":"IF(CH6<>\"\",'Request form'!$D$4,\"\")","v":""},{"$f":"IF(CH6<>\"\",'Request form'!$D$9,\"\")","v":""},{"$f":"IF(CH6<>\"\",IFERROR(IF(COUNTBLANK('Request form'!$D$7:$F$7)=0,'Request form'!$D$7&\"/\"&'Request form'!$E$7&\"/\"&'Request form'!$F$7,\"\"),\"\"),\"\")","v":""},{"$f":"IF(CH6<>\"\",IFERROR(IF(COUNTBLANK('Request form'!$D$8:$F$8)=0,'Request form'!$D$8&\"/\"&'Request form'!$E$8&\"/\"&'Request form'!$F$8,\"\"),\"\"),\"\")","v":""},{"$f":"IF(CH6<>\"\",'Request form'!$D$5,\"\")","v":""},{"$f":"IF(CH6<>\"\",'Request form'!$D$11,\"\")","v":""},"",null,null,null,null,"",null,null,null,null,null,null,null,null,null,null,null,{"$f":"IF(CH6<>\"\",IF('Request form'!G25=\"\",\"yes\",\"no\"),\"\")","v":""},{"$f":"IF(CH6<>\"\",IF(AM6=\"No\",'Request form'!G25,\"\"),\"\")","v":""},"",null,null,null,null,null,null,null,null,null,null,null,null,null,null,null,null,null,null,null,null,null,null,null,null,null,null,{"$f":"IF(CH6<>\"\",'Request form'!$D$14,\"\")","v":""},{"$f":"IF($CH6<>\"\",\"No\",\"\")","v":""},null,null,null,null,{"$f":"IF($CH6<>\"\",\"No\",\"\")","v":""},null,null,null,null,null,null,null,null,null,null,null,{"$f":"IF('Request form'!G18<>\"\",'Request form'!G18,\"\")","v":""},{"$f":"IF(CH6<>\"\",'Request form'!G19,\"\")","v":""},{"$f":"IF(CH6<>\"\",'Request form'!G20,\"\")","v":""},{"$f":"IF(AND(CH6<>\"\",'Request form'!D23<>\"\"),'Request form'!D23,\"\")","v":""},{"$f":"IF(AND(CH6<>\"\",'Request form'!D24<>\"\"),'Request form'!D24,\"\")","v":""},{"$f":"IF(CI6<>\"\",'Request form'!E24,\"\")","v":""},{"$f":"IF(AND(CH6<>\"\",'Request form'!D28<>\"\"),'Request form'!D28,\"\")","v":""},{"$f":"IFERROR(VLOOKUP($P6,VBAHelper!$D:$F,3,FALSE),\"\")","v":""}]
{"$rows_left_out":19}
{"sheet":"Request form","index":2,"n_rows":27,"n_cols":25,"rows_kept":27,"cut":false,"hidden":false,"merged":[[26,3,26,5],[3,0,4,0],[3,3,3,5],[4,3,4,5],[12,3,12,5],[23,3,23,5],[17,3,17,5],[15,3,15,5],[19,3,19,5],[5,0,8,0],[9,0,11,0],[11,3,11,5],[13,3,13,5],[14,3,14,5],[23,0,25,0],[16,0,16,2],[12,0,14,0],[1,2,1,5],[15,0,15,2],[18,3,18,5],[20,3,20,5],[17,0,22,0],[6,7,7,7],[8,3,8,5],[9,3,9,5],[10,3,10,5],[25,3,25,5],[24,3,24,5],[16,3,16,5],[21,3,21,5],[22,3,22,5]]}
[null,null,"NOP Import Certificate request form"]
[null,null,"To be filled by the exporter \nFollow the instructions mentioned in the \"Read me\" tab"]
["Entity information"]
[null,1,"certification standard"]
[null,2,"Products Exported from (country)"]
["VALIDITY PERIOD",null,null,"Month","day","year"]
{"$rows_left_out":22}
{"sheet":"VBAHelper","index":3,"n_rows":250,"n_cols":10,"rows_kept":250,"cut":false,"hidden":true,"merged":[]}
["Countries","US States",null,"Program Name on Certifier and Operation Profile --> Organic Standard",null,"Attestation Statement for Import Certificate",null,"Bulk or packaged",null,"Single shipment"]
["UNITED STATES OF AMERICA (THE)","Alabama",null,"USDA-NOP (U.S.A.)",null,"N/A"]
["ÅLAND ISLANDS","Alaska",null,"Canada Organic Regime (COR)",null,"Certified in compliance with the terms of the U.S.-Canada Organic Equivalency Arrangement",null,"Bulk",null,"Yes"]
["AFGHANISTAN","American Samoa",null,"European Organic Regulations",null,"Certified in compliance with the terms of the U.S.-European Union Organic Equivalence Arrangement",null,"Packaged",null,"No"]
["ALBANIA","Arizona",null,"Japanese Agricultural Standards (JAS)",null,"Certified in compliance with the terms of the U.S.-Japan Organic Equivalence Arrangement"]
["ALGERIA","Arkansas",null,"Korean Food Act",null,"Certified in compliance with the terms of the U.S.-Korea Organic Equivalency Arrangement"]
{"$rows_left_out":244}